{"text_format":"1","workbook":"xlsx","n_sheets":6,"sheets":["APU Profile Form","checklist","Roster","APU Master","FY23-FY24 Scales","APU Scale"],"not_rendered":{"charts":0,"images":0,"macros":1,"external_links":9,"defined_names":129,"comments":3,"pivot_tables":0},"unopened":[],"bounds":{"document_bytes":16777216,"sheet_cells":100000,"rows_first":2000,"rows_last":500,"rows_between":2000,"halvings":0,"cell_chars":16384,"cell_head_chars":4096},"cells_cut":0,"cells_raw":0,"read":"whole","date_system":"1900"}

{"sheet":"APU Profile Form","index":0,"n_rows":178,"n_cols":14,"rows_kept":178,"cut":false,"hidden":false,"merged":[[2,3,2,8],[4,3,4,8],[6,3,6,8],[8,3,8,8],[11,2,19,10]]}
[]
[]
[null,null,"DEPARTMENT:"]
[]
[null,null,"APU NAME:"]
[]
[null,null,"APU CODE:"]
[]
[null,null,"DATE SUBMITTED:",{"$f":"TODAY()","v":"2024-10-04"}]
[]
[null,null,"Description of APU:  Please include criteria used."]
[]
[]
[]
[]
[]
[]
[]
[]
[]
[]
[null,null,"PROPOSED HEALTH SCIENCES SALARY SCALE:"]
[null,null,"(Using Scale pay numbers: 1 thru 9. Insert Scale pay number assigned to APU for each of 5 future years.)"]
[]
[null,null,null,"2024-07-01",null,"2025-07-01",{"$f":"E25","v":0},"2026-07-01",{"$f":"G25","v":0}]
[]
[null,null,null,"2027-07-01",{"$f":"I25","v":0},"2028-07-01",{"$f":"E27","v":0}]
[]
[]
[]
{"$rows_left_out":149}
{"sheet":"checklist","index":1,"n_rows":19,"n_cols":2,"rows_kept":19,"cut":false,"hidden":false,"merged":[]}
["Checklist to review before sending for Dean's or VC's approval:"]
[]
[]
["APU profile form:"]
[null,"add all Faculty that belong to the code (including all the new Faculty appointments started during the current/prior FY)"]
[null,"remove all Faculty that no longer belong to the code"]
[null,"make sure all salary are based on the current, approved rank, step, and HSCP salary scales (do not use projected info)"]
[null,"* if APU scale is being changed for the APU code -> calculate the X', offscale, and Y based on the changed APU scale for ALL Faculty being listed"]
[null,"* if Faculty is being added to the APU code  -> calculate the X', offscale, and Y based on the changed APU scale for the newly added Faculty only"]
[null,"review to see if any APU code has fewer than 5 members, if so, this will be a compliance issue and department will need to provide justification in the memo to ask for the exceptional approval "]
[]
[]
["Chair's memo needs to include the following info:"]
[null,"list of all the changes being requested"]
[null,"justification for the requested changes"]
[null,"confirmation that all APU members are in good standing"]
[null,"confirmation that the department accepts 415(m) liability that may result"]
[null,"confirmation that the APU will be able to maintain the covered compensation rate for at least 3 years"]
[null,"if any APU code has fewer than 5 members, need to provide justification in the memo to ask for the exceptional approval "]

{"sheet":"Roster","index":2,"n_rows":139,"n_cols":16,"rows_kept":139,"cut":false,"hidden":true,"merged":[[7,10,7,14],[7,0,7,1],[7,2,7,9]]}
["I N S T R U C T I O N S :"]
["1. Click the",null,"button on the Roster tab, to clear existing data and prepare the form for entry.",null,null,null,null,null,"6. Paste Values (V) into the section highlighted yellow below (starting in Cell C10)."]
["2. In ARC ServiceNow, go to ARC Report Library > Compensation Reports > APU Profile Form.",null,null,null,null,null,null,null,"7. Type in the APU Code in Cell A10 and the APU Scale in Cell B10 (highlighted orange)."]
["3. In the APU Name Search box, type in the desired APU Code and hit Enter.",null,null,null,null,null,null,null,"7. Delete employees moving out of the APU and add employees moving into the APU."]
["4. Right click anywhere in the headers, go to the Export menu and select Excel (.xlsx).",null,null,null,null,null,null,null,"8. Sort Column D (AIR Profile) A to Z, so faculty members appear in alphabetical order."]
["5. Copy all data from the exported spreadsheet in Column C through Column J, starting at Row 2.",null,null,null,null,null,null,null,"10. On the APU Profile Form, hide all the blank linges and highlight the rows with new faculty."]
[]
["MANUAL  -  MANUAL",null,"A I R E L    -    A I R E L    -    A I R E L    -    A I R E L    -    A I R E L    -    A I R E L    -    A I R E L    -   A I R E L    -    A I R E L",null,null,null,null,null,null,null,"CALCULATED   -   CALCULATED   -   CALCULATED   -   CALCULATED"]
["APU Code","APU Scale","Department","AIR Profile","Rank","Step","Base (X)","Off Scale X","Total Negotiated (100%)","Stipend","Base (X)","X'","Total Off-Scale (X+X')","Total Covered Comp","Y","RankStepScale"]
["ORT001",6,"ORTHOPAEDIC SURGERY","Allen, Richard","Full","II",135400,0,300000,0,{"$f":"IFERROR(VLOOKUP(P10,'FY23-FY24 Scales'!A:J,10,FALSE),G10)","v":135400},{"$f":"IFERROR(VLOOKUP(P10,'FY23-FY24 Scales'!A:K,11,FALSE),ROUND(G10*VLOOKUP(B10*1,'APU Scale'!A:B,2,FALSE)-G10,-2))","v":88100},{"$f":"ROUND(H10*VLOOKUP(B10*1,'APU Scale'!A:B,2,FALSE),-2)","v":0},{"$f":"K10+L10+M10","v":223500},{"$f":"IF(I10-J10-N10<0,0,I10-J10-N10)","v":76500},{"$f":"CONCATENATE(E10,F10,B10)","v":"FullII6"}]
[{"$f":"A10","v":"ORT001"},{"$f":"B10","v":6},"ORTHOPAEDIC SURGERY","Blais, Micah","Assistant","II",91300,0,150700,0,{"$f":"IFERROR(VLOOKUP(P11,'FY23-FY24 Scales'!A:J,10,FALSE),G11)","v":91300},{"$f":"IFERROR(VLOOKUP(P11,'FY23-FY24 Scales'!A:K,11,FALSE),ROUND(G11*VLOOKUP(B11*1,'APU Scale'!A:B,2,FALSE)-G11,-2))","v":59400},{"$f":"ROUND(H11*VLOOKUP(B11*1,'APU Scale'!A:B,2,FALSE),-2)","v":0},150700,0,"AssistantII6"]
["ORT001",6,"ORTHOPAEDIC SURGERY","Chiarappa, Frank","Assistant","IV",101700,0,212100,0,{"$f":"IFERROR(VLOOKUP(P12,'FY23-FY24 Scales'!A:J,10,FALSE),G12)","v":101700},{"$f":"IFERROR(VLOOKUP(P12,'FY23-FY24 Scales'!A:K,11,FALSE),ROUND(G12*VLOOKUP(B12*1,'APU Scale'!A:B,2,FALSE)-G12,-2))","v":66200},{"$f":"ROUND(H12*VLOOKUP(B12*1,'APU Scale'!A:B,2,FALSE),-2)","v":0},167900,44200,"AssistantIV6"]
["ORT001",6,"ORTHOPAEDIC SURGERY","Foran, Ian","Assistant","III",96400,0,212100,0,{"$f":"IFERROR(VLOOKUP(P13,'FY23-FY24 Scales'!A:J,10,FALSE),G13)","v":96400},{"$f":"IFERROR(VLOOKUP(P13,'FY23-FY24 Scales'!A:K,11,FALSE),ROUND(G13*VLOOKUP(B13*1,'APU Scale'!A:B,2,FALSE)-G13,-2))","v":62700},{"$f":"ROUND(H13*VLOOKUP(B13*1,'APU Scale'!A:B,2,FALSE),-2)","v":0},159100,53000,"AssistantIII6"]
["ORT001",6,"ORTHOPAEDIC SURGERY","Girard, Paul","Full","II",135400,0,223500,0,{"$f":"IFERROR(VLOOKUP(P14,'FY23-FY24 Scales'!A:J,10,FALSE),G14)","v":135400},{"$f":"IFERROR(VLOOKUP(P14,'FY23-FY24 Scales'!A:K,11,FALSE),ROUND(G14*VLOOKUP(B14*1,'APU Scale'!A:B,2,FALSE)-G14,-2))","v":88100},{"$f":"ROUND(H14*VLOOKUP(B14*1,'APU Scale'!A:B,2,FALSE),-2)","v":0},223500,0,"FullII6"]
["ORT001",6,"ORTHOPAEDIC SURGERY","Gonzales, Francis","Full","I",125700,0,212100,0,{"$f":"IFERROR(VLOOKUP(P15,'FY23-FY24 Scales'!A:J,10,FALSE),G15)","v":125700},{"$f":"IFERROR(VLOOKUP(P15,'FY23-FY24 Scales'!A:K,11,FALSE),ROUND(G15*VLOOKUP(B15*1,'APU Scale'!A:B,2,FALSE)-G15,-2))","v":81800},{"$f":"ROUND(H15*VLOOKUP(B15*1,'APU Scale'!A:B,2,FALSE),-2)","v":0},207500,4600,"FullI6"]
["ORT001",6,"ORTHOPAEDIC SURGERY","Hentzen, Eric","Full","II",135400,0,223500,0,{"$f":"IFERROR(VLOOKUP(P16,'FY23-FY24 Scales'!A:J,10,FALSE),G16)","v":135400},{"$f":"IFERROR(VLOOKUP(P16,'FY23-FY24 Scales'!A:K,11,FALSE),ROUND(G16*VLOOKUP(B16*1,'APU Scale'!A:B,2,FALSE)-G16,-2))","v":88100},{"$f":"ROUND(H16*VLOOKUP(B16*1,'APU Scale'!A:B,2,FALSE),-2)","v":0},223500,0,"FullII6"]
["ORT001",6,"ORTHOPAEDIC SURGERY","Kent, William","Associate","I",107300,0,212100,0,{"$f":"IFERROR(VLOOKUP(P17,'FY23-FY24 Scales'!A:J,10,FALSE),G17)","v":107300},{"$f":"IFERROR(VLOOKUP(P17,'FY23-FY24 Scales'!A:K,11,FALSE),ROUND(G17*VLOOKUP(B17*1,'APU Scale'!A:B,2,FALSE)-G17,-2))","v":69800},{"$f":"ROUND(H17*VLOOKUP(B17*1,'APU Scale'!A:B,2,FALSE),-2)","v":0},177100,35000,"AssociateI6"]
["ORT001",6,"ORTHOPAEDIC SURGERY","Leek, Bryan","Associate","IV",125600,0,212100,0,{"$f":"IFERROR(VLOOKUP(P18,'FY23-FY24 Scales'!A:J,10,FALSE),G18)","v":125600},{"$f":"IFERROR(VLOOKUP(P18,'FY23-FY24 Scales'!A:K,11,FALSE),ROUND(G18*VLOOKUP(B18*1,'APU Scale'!A:B,2,FALSE)-G18,-2))","v":81800},{"$f":"ROUND(H18*VLOOKUP(B18*1,'APU Scale'!A:B,2,FALSE),-2)","v":0},207400,4700,"AssociateIV6"]
["ORT001",6,"ORTHOPAEDIC SURGERY","Mitchell, Joseph","Assistant","III",96400,0,212100,0,{"$f":"IFERROR(VLOOKUP(P19,'FY23-FY24 Scales'!A:J,10,FALSE),G19)","v":96400},{"$f":"IFERROR(VLOOKUP(P19,'FY23-FY24 Scales'!A:K,11,FALSE),ROUND(G19*VLOOKUP(B19*1,'APU Scale'!A:B,2,FALSE)-G19,-2))","v":62700},{"$f":"ROUND(H19*VLOOKUP(B19*1,'APU Scale'!A:B,2,FALSE),-2)","v":0},159100,53000,"AssistantIII6"]
["ORT001",6,"ORTHOPAEDIC SURGERY","O'leary, Ryan","Assistant","II",91300,0,212100,0,{"$f":"IFERROR(VLOOKUP(P20,'FY23-FY24 Scales'!A:J,10,FALSE),G20)","v":91300},{"$f":"IFERROR(VLOOKUP(P20,'FY23-FY24 Scales'!A:K,11,FALSE),ROUND(G20*VLOOKUP(B20*1,'APU Scale'!A:B,2,FALSE)-G20,-2))","v":59400},{"$f":"ROUND(H20*VLOOKUP(B20*1,'APU Scale'!A:B,2,FALSE),-2)","v":0},150700,61400,"AssistantII6"]
["ORT001",6,"ORTHOPAEDIC SURGERY","Robertson, Catherine","Full","I",125700,0,212100,0,{"$f":"IFERROR(VLOOKUP(P21,'FY23-FY24 Scales'!A:J,10,FALSE),G21)","v":125700},{"$f":"IFERROR(VLOOKUP(P21,'FY23-FY24 Scales'!A:K,11,FALSE),ROUND(G21*VLOOKUP(B21*1,'APU Scale'!A:B,2,FALSE)-G21,-2))","v":81800},{"$f":"ROUND(H21*VLOOKUP(B21*1,'APU Scale'!A:B,2,FALSE),-2)","v":0},207500,4600,"FullI6"]
["ORT001",6,"ORTHOPAEDIC SURGERY","Sullivan, Thomas","Assistant","III",96400,0,212100,0,{"$f":"IFERROR(VLOOKUP(P22,'FY23-FY24 Scales'!A:J,10,FALSE),G22)","v":96400},{"$f":"IFERROR(VLOOKUP(P22,'FY23-FY24 Scales'!A:K,11,FALSE),ROUND(G22*VLOOKUP(B22*1,'APU Scale'!A:B,2,FALSE)-G22,-2))","v":62700},{"$f":"ROUND(H22*VLOOKUP(B22*1,'APU Scale'!A:B,2,FALSE),-2)","v":0},159100,53000,"AssistantIII6"]
["ORT001",6,"ORTHOPAEDIC SURGERY","Zlomislic, Vinko","Associate","III",118900,0,212100,0,{"$f":"IFERROR(VLOOKUP(P23,'FY23-FY24 Scales'!A:J,10,FALSE),G23)","v":118900},{"$f":"IFERROR(VLOOKUP(P23,'FY23-FY24 Scales'!A:K,11,FALSE),ROUND(G23*VLOOKUP(B23*1,'APU Scale'!A:B,2,FALSE)-G23,-2))","v":77300},{"$f":"ROUND(H23*VLOOKUP(B23*1,'APU Scale'!A:B,2,FALSE),-2)","v":0},196200,15900,"AssociateIII6"]
["ORT001",6,null,null,null,null,null,null,null,null,{"$f":"IFERROR(VLOOKUP(P24,'FY23-FY24 Scales'!A:J,10,FALSE),G24)","v":0},{"$f":"IFERROR(VLOOKUP(P24,'FY23-FY24 Scales'!A:K,11,FALSE),ROUND(G24*VLOOKUP(B24*1,'APU Scale'!A:B,2,FALSE)-G24,-2))","v":0},{"$f":"ROUND(H24*VLOOKUP(B24*1,'APU Scale'!A:B,2,FALSE),-2)","v":0},0,0,"6"]
["ORT001",6,null,null,null,null,null,null,null,null,{"$f":"IFERROR(VLOOKUP(P25,'FY23-FY24 Scales'!A:J,10,FALSE),G25)","v":0},{"$f":"IFERROR(VLOOKUP(P25,'FY23-FY24 Scales'!A:K,11,FALSE),ROUND(G25*VLOOKUP(B25*1,'APU Scale'!A:B,2,FALSE)-G25,-2))","v":0},{"$f":"ROUND(H25*VLOOKUP(B25*1,'APU Scale'!A:B,2,FALSE),-2)","v":0},0,0,"6"]
["ORT001",6,null,null,null,null,null,null,null,null,{"$f":"IFERROR(VLOOKUP(P26,'FY23-FY24 Scales'!A:J,10,FALSE),G26)","v":0},{"$f":"IFERROR(VLOOKUP(P26,'FY23-FY24 Scales'!A:K,11,FALSE),ROUND(G26*VLOOKUP(B26*1,'APU Scale'!A:B,2,FALSE)-G26,-2))","v":0},{"$f":"ROUND(H26*VLOOKUP(B26*1,'APU Scale'!A:B,2,FALSE),-2)","v":0},0,0,"6"]
["ORT001",6,null,null,null,null,null,null,null,null,{"$f":"IFERROR(VLOOKUP(P27,'FY23-FY24 Scales'!A:J,10,FALSE),G27)","v":0},{"$f":"IFERROR(VLOOKUP(P27,'FY23-FY24 Scales'!A:K,11,FALSE),ROUND(G27*VLOOKUP(B27*1,'APU Scale'!A:B,2,FALSE)-G27,-2))","v":0},{"$f":"ROUND(H27*VLOOKUP(B27*1,'APU Scale'!A:B,2,FALSE),-2)","v":0},0,0,"6"]
["ORT001",6,null,null,null,null,null,null,null,null,{"$f":"IFERROR(VLOOKUP(P28,'FY23-FY24 Scales'!A:J,10,FALSE),G28)","v":0},{"$f":"IFERROR(VLOOKUP(P28,'FY23-FY24 Scales'!A:K,11,FALSE),ROUND(G28*VLOOKUP(B28*1,'APU Scale'!A:B,2,FALSE)-G28,-2))","v":0},{"$f":"ROUND(H28*VLOOKUP(B28*1,'APU Scale'!A:B,2,FALSE),-2)","v":0},0,0,"6"]
["ORT001",6,null,null,null,null,null,null,null,null,{"$f":"IFERROR(VLOOKUP(P29,'FY23-FY24 Scales'!A:J,10,FALSE),G29)","v":0},{"$f":"IFERROR(VLOOKUP(P29,'FY23-FY24 Scales'!A:K,11,FALSE),ROUND(G29*VLOOKUP(B29*1,'APU Scale'!A:B,2,FALSE)-G29,-2))","v":0},{"$f":"ROUND(H29*VLOOKUP(B29*1,'APU Scale'!A:B,2,FALSE),-2)","v":0},0,0,"6"]
["ORT001",6,null,null,null,null,null,null,null,null,{"$f":"IFERROR(VLOOKUP(P30,'FY23-FY24 Scales'!A:J,10,FALSE),G30)","v":0},{"$f":"IFERROR(VLOOKUP(P30,'FY23-FY24 Scales'!A:K,11,FALSE),ROUND(G30*VLOOKUP(B30*1,'APU Scale'!A:B,2,FALSE)-G30,-2))","v":0},{"$f":"ROUND(H30*VLOOKUP(B30*1,'APU Scale'!A:B,2,FALSE),-2)","v":0},0,0,"6"]
{"$rows_left_out":110}
{"sheet":"APU Master","index":3,"n_rows":98,"n_cols":5,"rows_kept":98,"cut":false,"hidden":true,"merged":[]}
["as of 6/28/24"]
["APU Master List"]
[]
["Department/School","APU Code","Scale","APU Name","APU Definition"]
["Anesthesiology","ANE001",5,"Anesthesiology Clinical Faculty","All clinical faculty members in department."]
["Anesthesiology","ANEGCP",1,"Anesthesiology Ph.D. Faculty","All Ph.D. faculty members in department."]
["Cellular & Molecular Medicine","CMM001",4,"Cellular & Molecular Medicine","Faculty with primary appointment in the Department of Cellular and Molecular Medicine."]
["Dermatology ","MED043",3,"Dermatology Clinical Faculty","Clinically active faculty members in the Division of Dermatology."]
["Dermatology ","PEDDER",7,"Dermatology  ","Faculty specializing in Pediatric Dermatology who hold M.D. degree"]
["Emergency Medicine","EMS001",7,"DEM Faculty Leadership (EMS)","All faculty board certified in Emergency Medicine with active clinical, teaching, and scholarly profiles and have current major administrative and academic leadership positions or responsibilities, and must be long term positions within the department (e.g., Chair, Vice Chair, etc.)."]
["Emergency Medicine","EMS002",6,"DEM Faculty (EMS)","Full-time EMS faculty carrying full clinical responsibility along with teaching and scholarly productivity requirements."]
["Emergency Medicine","EMS003",1,"DEM Research Faculty","All faculty in this APU are PhD researchers in the Dept of Emergency Medicine."]
["Family Medicine","FPM001",5,"Family Medicine Physician and Leadership Faculty","All department faculty with medical doctoral degree (e.g. MD, DO) and/or Vice Chairs and Division Chiefs with or without medical doctoral degree (e.g. MD, DO, PhD, PsyD)."]
["Family Medicine","FPM002",3,"Family Medicine Non-Physician Faculty","All department faculty with non-medical doctoral degrees (e.g. PhD, PsyD)."]
["Family Medicine","FPM003",5,"Family Medicine PACE Faculty","All department faculty who are PACE (Physician Assessment Clinical Ed) Program faculty directors."]
["Medicine","MED029",1,"Gastroenterology Research Faculty","Research faculty members in the Division of Gastroenterology without clinical duties.  Other Department research oriented faculty members without clinical duties may participate in this APU as well."]
["Medicine","MED031",3,"Genomics & Precision Medicine Faculty","Clinically active and Research faculty members in the Division of Genomics & Precision Medicine."]
["Medicine","MED041",3,"Bone Marrow Transplantation Faculty","Clinically active faculty members in the Division of Bone Marrow Transplant."]
["Medicine","MED042",3,"Cardiovascular Medicine Clinical & Research Faculty","Clinically active and Research faculty members in the Division of Cardiovascular Medicine."]
["Medicine","MED044",3,"Endocrinology/Metabolism Clinical & Research Faculty","Clinically active and Research faculty members in the Division of Endocrinology/Metabolism."]
["Medicine","MED045",3,"Gastroenterology/Hepatology Clinical & Research Faculty","Clinically  active and Research faculty members in the Division of Gastroenterology/Hepatology."]
["Medicine","MED046",3,"General Internal Medicine Clinical & Research Faculty","Clinically active and Research faculty members in the Division of General Internal Medicine."]
["Medicine","MED048",3,"Hematology/Oncology Clinical & Research Faculty","Clinically active and Research faculty members in the Division of Hematology/Oncology."]
["Medicine","MED049",3,"Hospital Medicine Clinical Faculty","Clinically active faculty members in the Division of Hospital Medicine."]
["Medicine","MED050",3,"Infectious Diseases Clinical & Research Faculty","Clinically active and Research faculty members in the Division of Infectious Diseases."]
["Medicine","MED051",3,"Nephrology Clinical & Research Faculty","Clinically active and Research faculty members in the Division of Nephrology."]
["Medicine","MED053",3,"Pulmonary Clinical & Research Faculty","Clinically active and Research faculty members in the Division of Pulmonary."]
["Medicine","MED054",3,"Rheumatology, Autoimmunity and Inflammation and Allergy and Immunology Faculty","Clinically active and Research faculty members in the Division of Rheumatology, Autoimmunity and Inflammation and the Division of Allergy and Immunology."]
["Medicine","MED055",3,"Owens Clinical & Research Faculty","Clinically active and Research faculty members in the Division Owens Clinic."]
["Medicine","MED056",7,"Endocrinology/Metabolism APU7","Board Certified Endocrinologists with Academic Senate membership in FTE or IR series who are eligible for 100% UCRP participation."]
{"$rows_left_out":69}
{"sheet":"FY23-FY24 Scales","index":4,"n_rows":204,"n_cols":12,"rows_kept":204,"cut":false,"hidden":true,"merged":[]}
["USE THIS TO VERIFY the X, X', and covered comp"]
["* May want to replace \"Full\" with \"Full to match the APU profile"]
[]
["Concatenate (roman numero + user \"Full\" instead of \"Full\")","Step (roman numero)","Concatenate","APU","Rank","Step","07/01 X","07/01 X' actual","07/01 Covered Comp","10/01 X","10/01 X' actual","10/01 Covered Comp"]
[{"$f":"CONCATENATE(E5,B5,D5)","v":"AssistantI0"},{"$f":"ROMAN(F5)","v":"I"},{"$f":"CONCATENATE(E5,F5,D5)","v":"Assistant10"},0,"Assistant",1,82200,0,{"$f":"SUM(G5:H5)","v":82200},86500,0,{"$f":"SUM(J5:K5)","v":86500}]
[{"$f":"CONCATENATE(E6,B6,D6)","v":"AssistantII0"},{"$f":"ROMAN(F6)","v":"II"},{"$f":"CONCATENATE(E6,F6,D6)","v":"Assistant20"},0,"Assistant",2,87100,0,87100,91300,0,{"$f":"SUM(J6:K6)","v":91300}]
[{"$f":"CONCATENATE(E7,B7,D7)","v":"AssistantIII0"},"III","Assistant30",0,"Assistant",3,92100,0,92100,96400,0,96400]
["AssistantIV0","IV","Assistant40",0,"Assistant",4,97200,0,97200,101700,0,101700]
["AssistantV0","V","Assistant50",0,"Assistant",5,102400,0,102400,107200,0,107200]
["AssistantVI0","VI","Assistant60",0,"Assistant",6,107700,0,107700,112800,0,112800]
["AssociateI0","I","Associate10",0,"Associate",1,102500,0,102500,107300,0,107300]
["AssociateII0","II","Associate20",0,"Associate",2,107800,0,107800,112900,0,112900]
["AssociateIII0","III","Associate30",0,"Associate",3,113400,0,113400,118900,0,118900]
["AssociateIV0","IV","Associate40",0,"Associate",4,120100,0,120100,125600,0,125600]
["AssociateV0","V","Associate50",0,"Associate",5,129300,0,129300,135300,0,135300]
["FullI0","I","Full10",0,"Full",1,120200,0,120200,125700,0,125700]
["FullII0","II","Full20",0,"Full",2,129400,0,129400,135400,0,135400]
["FullIII0","III","Full30",0,"Full",3,139400,0,139400,145900,0,145900]
["FullIV0","IV","Full40",0,"Full",4,149900,0,149900,156900,0,156900]
["FullV0","V","Full50",0,"Full",5,161100,0,161100,168700,0,168700]
["FullVI0","VI","Full60",0,"Full",6,173200,0,173200,181200,0,181200]
["FullVII0","VII","Full70",0,"Full",7,186500,0,186500,195100,0,195100]
["FullVIII0","VIII","Full80",0,"Full",8,201600,0,201600,210900,0,210900]
["FullIX0","IX","Full90",0,"Full",9,218500,0,218500,228600,0,228600]
["AssistantI1","I","Assistant11",1,"Assistant",1,82200,8300,90500,86500,8700,95200]
["AssistantII1","II","Assistant21",1,"Assistant",2,87100,8800,95900,91300,9200,100500]
["AssistantIII1","III","Assistant31",1,"Assistant",3,92100,9300,101400,96400,9700,106100]
["AssistantIV1","IV","Assistant41",1,"Assistant",4,97200,9800,107000,101700,10200,111900]
["AssistantV1","V","Assistant51",1,"Assistant",5,102400,10300,112700,107200,10800,118000]
["AssistantVI1","VI","Assistant61",1,"Assistant",6,107700,10800,118500,112800,11300,124100]
{"$rows_left_out":175}
{"sheet":"APU Scale","index":5,"n_rows":11,"n_cols":2,"rows_kept":11,"cut":false,"hidden":true,"merged":[]}
["Scale","Multiplier"]
[0,1]
[1,1.1000000000000001]
[2,1.2]
[3,1.3]
[4,1.4]
[5,1.5]
[6,1.65]
[7,1.8]
[8,2]
[9,2.25]